{"text_format":"3","workbook":"xlsx","n_sheets":11,"sheets":["Person 1","Person 2","Person 3","Person 4","Person 5","Person 6","Person 7","Person 8","Person 9","Person 10","Person 11"],"read":"whole","date_system":"1900"}

{"sheet":"Person 1","index":0,"n_rows":32,"n_cols":14,"rows_kept":32,"merged":[[0,11,0,12],[0,13,0,17]]}
["Time","Radar S1","Radar S2","PCG S1","PCG S2","Pulse","ECG","Breathing","Quality Radar Signal","Quality PCG Signal","Overall Signal Quality","Measurement Position",null,"Scenario"]
["2016-12-20_11-25-55","A","B","A","B","C","A","C",{"$f":"IF(AND(B2=\"A\",C2=\"A\"),\"A\",IF(OR(B2=\"C\",C2=\"C\"),\"C\",\"B\"))","v":"B"},{"$f":"IF(AND(D2=\"A\",E2=\"A\"),\"A\",IF(OR(D2=\"C\",E2=\"C\"),\"C\",\"B\"))","v":"B"},{"$f":"IF(AND(B2=\"A\",C2=\"A\",D2=\"A\",E2=\"A\"),\"A\",IF(OR(B2=\"C\",C2=\"C\",D2=\"C\",E2=\"C\"),\"C\",\"B\"))","v":"B"},"PCG_front_radar_front","Radar 2L PCG 4L"]
["2016-12-20_11-30-47","A","B","A","C","C","A","A",{"$f":"IF(AND(B3=\"A\",C3=\"A\"),\"A\",IF(OR(B3=\"C\",C3=\"C\"),\"C\",\"B\"))","v":"B"},{"$f":"IF(AND(D3=\"A\",E3=\"A\"),\"A\",IF(OR(D3=\"C\",E3=\"C\"),\"C\",\"B\"))","v":"C"},{"$f":"IF(AND(B3=\"A\",C3=\"A\",D3=\"A\",E3=\"A\"),\"A\",IF(OR(B3=\"C\",C3=\"C\",D3=\"C\",E3=\"C\"),\"C\",\"B\"))","v":"C"},"PCG_front_radar_front","Radar 2L PCG 4L"]
["2016-12-20_11-36-19","A","B","A","A","C","A","C","B","A","B","PCG_front_radar_front","Radar 2L PCG 4L"]
["2016-12-20_11-46-09","A","B","A","A","C","A","C","B","A","B","PCG_front_radar_front","Radar 2L PCG 4L"]
["2016-12-20_11-49-00","A","B","A","A","C","A","C","B","A","B","PCG_front_radar_front","Radar 2L PCG 4L"]
["2016-12-20_11-55-32","A","A","A","A","C","A","C","A","A","A","PCG_front_radar_front","Radar 2L PCG 4L"]
["2016-12-20_11-59-04","A","A","A","B","C","A","C","A","B","B","PCG_front_radar_front","Radar 2L PCG 4L"]
["2016-12-20_12-01-25","A","A","C","C","C","A","C","A","C","C","PCG_front_radar_front","Radar 2L PCG 4L"]
["2016-12-20_12-03-18","A","A","C","C","C","A","C","A","C","C","PCG_front_radar_front","Radar 2L PCG 4L"]
["2016-12-20_12-05-27","A","A","A","A","C","B","C","A","A","A","PCG_front_radar_front","Radar 2L PCG 4L"]
["2016-12-20_12-07-18","A","A","A","A","C","B","C","A","A","A","PCG_front_radar_front","Radar 2L PCG 4L"]
["2016-12-20_12-09-43","A","A","A","A","B","A","C","A","A","A","PCG_front_radar_front","Radar 2L PCG 4L"]
["2016-12-20_12-14-12","A","A","A","A","C","B","C","A","A","A","PCG_front_radar_front","Radar 4L PCG 2L"]
["2016-12-20_12-18-32","A","A","A","A","C","B","B","A","A","A","PCG_front_radar_front","Radar 4L PCG 2L"]
["2016-12-20_12-22-46","A","A","A","A","C","A","A","A","A","A","PCG_front_radar_front","Radar 4L PCG 2L"]
["2016-12-20_12-25-17","B","B","A","A","C","A","C","B","A","B","PCG_front_radar_front","Radar 4L PCG 2L"]
["2016-12-20_13-39-55","A","A","A","A","C","A","A","A","A","A","PCG_front_radar_front","Radar 4L PCG 2L"]
["2016-12-20_13-43-03","B","B","B","B","C","B","A","B","B","B","PCG_front_radar_front","Radar 4L PCG 2L"]
["2016-12-20_13-44-24","A","A","B","B","C","A","B","A","B","B","PCG_front_radar_front","Radar 4L PCG 2L"]
["2016-12-20_13-47-09","A","B","B","C","C","B","B","B","C","C","PCG_front_radar_front","Radar 4L PCG 2L"]
["2016-12-20_13-49-09","A","A","C","C","C","A","B","A","C","C","PCG_front_radar_front","Radar 4L PCG 2L"]
["2016-12-20_13-52-11","A","B","A","B","C","B","B","B","B","B","PCG_front_radar_front","Radar 4L PCG 2L"]
["2016-12-20_13-55-07","A","A","A","A","C","A","B","A","A","A","PCG_front_radar_front","Radar 4L PCG 2L"]
["2016-12-20_14-00-47","A","A","A","A","C","B","C","A","A","A","PCG_front_radar_front","Radar 4L PCG 2L","apnea_after_sport"]
["2016-12-20_14-05-02","A","B","A","B","C","B","A","B","B","B","PCG_front_radar_front","Radar 4L PCG 2L","apnea_after_sport"]
["2016-12-20_14-12-25","A","B","A","A","C","B","A","B","A","B","PCG_front_radar_front","Radar 4L PCG 2L","apnea_after_sport"]
["2016-12-20_14-18-36","C","B","A","A","C","A","A","C","A","C","PCG_neck_radar_neck","PCG carotid L radar carotid R","apnea"]
["2016-12-20_14-23-53","C","C","A","A","B","A","A","C","A","C","PCG_neck_radar_neck","PCG carotid L radar carotid R","apnea"]
["2016-12-20_14-28-02","C","B","A","A","B","A","C","C","A","C","PCG_neck_radar_neck","PCG carotid L radar carotid R","apnea"]
["2016-12-20_14-36-52","A","B","A","A","C","B","A","B","A","B","PCG_neck_radar_front","PCG carotid L radar 2L","apnea_after_sport"]
["2016-12-20_14-44-53","B","C","A","B","C","A","A","C","B","C","PCG_front_radar_back","PCG 4L radar back","apnea_after_sport"]

{"sheet":"Person 2","index":1,"n_rows":36,"n_cols":15,"rows_kept":36,"merged":[[0,11,0,12],[0,13,0,17]]}
["Time","Radar S1","Radar S2","PCG S1","PCG S2","Pulse","ECG","Breathing","Quality Radar Signal","Quality PCG Signal","Overall Signal Quality","Measurement Position",null,"Scenario"]
["2016-12-21_10-13-18","A","A","A","B","C","A","C",{"$f":"IF(AND(B2=\"A\",C2=\"A\"),\"A\",IF(OR(B2=\"C\",C2=\"C\"),\"C\",\"B\"))","v":"A"},{"$f":"IF(AND(D2=\"A\",E2=\"A\"),\"A\",IF(OR(D2=\"C\",E2=\"C\"),\"C\",\"B\"))","v":"B"},{"$f":"IF(AND(B2=\"A\",C2=\"A\",D2=\"A\",E2=\"A\"),\"A\",IF(OR(B2=\"C\",C2=\"C\",D2=\"C\",E2=\"C\"),\"C\",\"B\"))","v":"B"},"PCG_front_radar_front","Radar Xiphoid PCG 4L"]
["2016-12-21_10-16-43","A","A","A","A","A","B","C",{"$f":"IF(AND(B3=\"A\",C3=\"A\"),\"A\",IF(OR(B3=\"C\",C3=\"C\"),\"C\",\"B\"))","v":"A"},{"$f":"IF(AND(D3=\"A\",E3=\"A\"),\"A\",IF(OR(D3=\"C\",E3=\"C\"),\"C\",\"B\"))","v":"A"},{"$f":"IF(AND(B3=\"A\",C3=\"A\",D3=\"A\",E3=\"A\"),\"A\",IF(OR(B3=\"C\",C3=\"C\",D3=\"C\",E3=\"C\"),\"C\",\"B\"))","v":"A"},"PCG_front_radar_front","Radar Xiphoid PCG 4L"]
["2016-12-21_10-21-20","A","A","A","A","C","A","C","A","A","A","PCG_front_radar_front","Radar Xiphoid PCG 4L"]
["2016-12-21_10-37-37","A","A","A","A","B","A","C","A","A","A","PCG_front_radar_front","Radar Xiphoid PCG 4L","apnea"]
["2016-12-21_10-43-30","A","A","A","A","B","A","A","A","A","A","PCG_front_radar_front","Radar Xiphoid PCG 4L","apnea"]
["2016-12-21_10-48-50","A","A","A","A","C","B","C","A","A","A","PCG_front_radar_front","Radar Xiphoid PCG 4L","apnea_after_sport"]
["2016-12-21_10-55-01","A","A","A","A","B","A","C","A","A","A","PCG_front_radar_front","Radar 2L PCG Xiphoid","apnea"]
["2016-12-21_11-15-34","B","A","A","A","C","A","C","B","A","B","PCG_front_radar_front","Radar 2L PCG 4L","apnea","exhaled"]
["2016-12-21_11-24-32","B","A","C","A","A","A","C","B","C","C","PCG_neck_radar_neck","PCG carotid L radar carotid R"]
["2016-12-21_11-29-38","C","B","C","B","A","A","C","C","C","C","PCG_neck_radar_neck","PCG carotid L radar carotid R"]
["2016-12-21_11-53-23","A","A","A","A","C","B","A","A","A","A","PCG_front_radar_front","Radar 2L PCG 4L","after_sport"]
["2016-12-21_11-59-37","B","B","A","A","C","B","B","B","A","B","PCG_front_radar_front","Radar 2L PCG 4L","apnea_after_sport"]
["2016-12-21_12-07-06","A","A","A","A","C","A","C","A","A","A","PCG_front_radar_front","Radar 4L PCG 2L","after_sport"]
["2017-02-17_09-53-27","A","A","A","A","A","A","C",{"$f":"IF(AND(B15=\"A\",C15=\"A\"),\"A\",IF(OR(B15=\"C\",C15=\"C\"),\"C\",\"B\"))","v":"A"},{"$f":"IF(AND(D15=\"A\",E15=\"A\"),\"A\",IF(OR(D15=\"C\",E15=\"C\"),\"C\",\"B\"))","v":"A"},{"$f":"IF(AND(B15=\"A\",C15=\"A\",D15=\"A\",E15=\"A\"),\"A\",IF(OR(B15=\"C\",C15=\"C\",D15=\"C\",E15=\"C\"),\"C\",\"B\"))","v":"A"},"PCG_front_radar_front","Radar 2L PCG 4L","lying"]
["2017-02-17_10-02-33","A","A","A","A","C","A","C","A","A","A","PCG_front_radar_front","Radar 2L PCG 4L","lying"]
["2017-02-17_10-07-23","B","A","A","B","C","A","A","B","B","B","PCG_front_radar_front","Radar 2L PCG 4L","lying"]
["2017-02-17_10-10-52","A","A","A","A","C","A","A","A","A","A","PCG_front_radar_front","Radar 2L PCG 4L","lying"]
["2017-02-27_09-55-24","A","A","A","A","B","A","C","A","A","A","PCG_front_radar_front","Radar 2L PCG 4L"]
["2017-02-27_10-04-44","A","A","A","A","A","A","A","A","A","A","PCG_front_radar_front","Radar 2L PCG 4L"]
["2017-02-27_10-06-53","A","A","A","A","A","A","A","A","A","A","PCG_front_radar_front","Radar 2L PCG 4L"]
["2017-02-27_10-08-59","A","A","A","A","A","A","C","A","A","A","PCG_front_radar_front","Radar 2L PCG 4L"]
["2017-02-27_10-10-49","A","B","A","A","C","A","C","B","A","B","PCG_front_radar_front","Radar 2L PCG 4L"]
["2017-02-27_10-13-10","A","A","A","A","A","A","C","A","A","A","PCG_front_radar_front","Radar 2L PCG 4L","apnea","inhaled"]
["2017-02-27_10-15-48","A","A","A","A","A","A","C","A","A","A","PCG_front_radar_front","Radar 2L PCG 4L","apnea","exhaled"]
["2017-02-27_10-18-52","A","A","A","A","C","A","A","A","A","A","PCG_front_radar_front","Radar 2L PCG 4L","angle_variation","30_degree_right"]
["2017-02-27_10-20-39","A","A","A","A","B","A","C","A","A","A","PCG_front_radar_front","Radar 2L PCG 4L","angle_variation","30_degree_left"]
["2017-02-27_10-23-58","A","A","A","A","C","A","C","A","A","A","PCG_front_radar_front","Radar 2L PCG 4L","artefact_movement"]
["2017-02-27_10-28-36","A","A","C","C","C","A","A","A","C","C","PCG_front_radar_front","Radar 2L PCG 2R"]
["2017-02-27_10-31-18","A","A","A","A","B","B","A","A","A","A","PCG_front_radar_front","Radar 2R PCG 2L"]
["2017-02-27_10-33-30","C","C","A","A","C","A","A","C","A","C","PCG_front_radar_front","Radar 2R PCG 2L"]
["2017-02-27_10-36-48","A","A","A","A","A","A","B","A","A","A","PCG_front_radar_front","Radar 4L PCG 2L"]
["2017-02-27_10-38-25","A","A","A","A","A","A","B","A","A","A","PCG_front_radar_front","Radar 4L PCG 2L"]
["2017-02-27_10-40-06","A","A","A","A","A","A","A","A","A","A","PCG_front_radar_front","Radar 4L PCG 2L"]
["2017-02-27_10-41-45","A","A","A","A","A","A","B","A","A","A","PCG_front_radar_front","Radar 4L PCG 2L"]
["2017-02-27_10-43-46","A","B","A","B","C","A","C","B","B","B","PCG_front_radar_front","Radar 4L PCG 2L"]

{"sheet":"Person 3","index":2,"n_rows":22,"n_cols":15,"rows_kept":22,"merged":[[0,11,0,12],[0,13,0,17]]}
["Time","Radar S1","Radar S2","PCG S1","PCG S2","Pulse","ECG","Breathing","Quality Radar Signal","Quality PCG Signal","Overall Signal Quality","Measurement Position",null,"Scenario"]
["2017-01-17_17-41-07","A","A","B","B","C","A","C",{"$f":"IF(AND(B2=\"A\",C2=\"A\"),\"A\",IF(OR(B2=\"C\",C2=\"C\"),\"C\",\"B\"))","v":"A"},{"$f":"IF(AND(D2=\"A\",E2=\"A\"),\"A\",IF(OR(D2=\"C\",E2=\"C\"),\"C\",\"B\"))","v":"B"},{"$f":"IF(AND(B2=\"A\",C2=\"A\",D2=\"A\",E2=\"A\"),\"A\",IF(OR(B2=\"C\",C2=\"C\",D2=\"C\",E2=\"C\"),\"C\",\"B\"))","v":"B"},"PCG_front_radar_front","Radar Xiphoid PCG 2L"]
["2017-01-17_17-48-53","A","A","A","A","C","A","A","A","A","A","PCG_front_radar_front","Radar 4L PCG 2L"]
["2017-01-17_17-55-53","A","A","B","B","C","A","A","A","B","B","PCG_front_radar_front","Radar 4L PCG 2L"]
["2017-01-17_17-59-08","A","A","B","A","C","A","C","A","B","B","PCG_front_radar_front","Radar 4L PCG 2L"]
["2017-01-17_18-04-18","A","B","B","A","C","B","C","B","B","B","PCG_front_radar_front","Radar 4L PCG 2L"]
["2017-01-17_18-09-55","A","A","C","C","C","A","B","A","C","C","PCG_front_radar_front","Radar 4L PCG 2L","apnea"]
["2017-01-17_18-14-30","A","A","C","B","C","A","B","A","C","C","PCG_front_radar_front","Radar 4L PCG 2L","apnea"]
["2017-01-17_18-23-25","C","C","A","A","C","A","B","C","A","C","PCG_front_radar_front","Radar 2L PCG 4L"]
["2017-01-17_18-27-42","A","A","A","A","C","A","C","A","A","A","PCG_front_radar_front","Radar 4L PCG 4R","sitting"]
["2017-01-17_18-32-11","A","A","A","A","C","A","C","A","A","A","PCG_front_radar_front","Radar 4L PCG 4R","sitting"]
["2017-01-17_18-38-06","A","A","A","A","C","B","C","A","A","A","PCG_front_radar_front","Radar 4L PCG 4R","after_sport"]
["2017-01-17_18-55-44","A","A","A","A","C","B","C","A","A","A","PCG_front_radar_front","Radar 4L PCG 4R","angle_variation","30_degree_left"]
["2017-01-17_19-00-08","A","B","A","A","C","A","C","B","A","B","PCG_front_radar_front","Radar 4L PCG 4R","angle_variation","30_degree_right"]
["2017-01-17_19-03-06","A","A","A","A","C","A","C","A","A","A","PCG_front_radar_front","Radar 4L PCG 4R","sitting"]
["2017-01-17_19-09-33","C","C","A","A","C","B","A","C","A","C","PCG_neck_radar_neck","Radar carotid L PCG carotid R"]
["2017-01-17_19-12-55","A","A","A","A","C","A","A","A","A","A","PCG_neck_radar_neck","Radar carotid L PCG carotid R"]
["2017-01-17_19-23-43","A","A","A","A","C","B","C","A","A","A","PCG_front_radar_front","Radar 4L PCG 4R","distance_variation"]
["2017-01-17_19-28-14","A","A","A","A","C","B","C","A","A","A","PCG_front_radar_front","Radar 4L PCG 4R","distance_variation"]
["2017-01-17_19-33-29","A","A","A","A","C","B","C","A","A","A","PCG_front_radar_front","Radar 4L PCG 4R","artefact_speech"]
["2017-01-17_19-38-24","A","A","A","A","C","A","C","A","A","A","PCG_front_radar_front","Radar 4L PCG 4R","standing"]
["2017-01-17_19-43-04","A","A","A","A","C","B","C","A","A","A","PCG_front_radar_front","Radar 4L PCG 4R","standing"]

{"sheet":"Person 4","index":3,"n_rows":18,"n_cols":14,"rows_kept":18,"merged":[[0,11,0,12],[0,13,0,17]]}
["Time","Radar S1","Radar S2","PCG S1","PCG S2","Pulse","ECG","Breathing","Quality Radar Signal","Quality PCG Signal","Overall Signal Quality","Measurement Position",null,"Scenario"]
["2017-01-20_10-41-20","C","C","A","B","B","B","A",{"$f":"IF(AND(B2=\"A\",C2=\"A\"),\"A\",IF(OR(B2=\"C\",C2=\"C\"),\"C\",\"B\"))","v":"C"},{"$f":"IF(AND(D2=\"A\",E2=\"A\"),\"A\",IF(OR(D2=\"C\",E2=\"C\"),\"C\",\"B\"))","v":"B"},{"$f":"IF(AND(B2=\"A\",C2=\"A\",D2=\"A\",E2=\"A\"),\"A\",IF(OR(B2=\"C\",C2=\"C\",D2=\"C\",E2=\"C\"),\"C\",\"B\"))","v":"C"},"PCG_front_radar_front","PCG 4L Radar Xiphoid"]
["2017-01-20_10-46-38","C","C","A","B","C","A","A","C","B","C","PCG_front_radar_front","PCG 5L Radar 4L"]
["2017-01-20_10-55-02","A","B","A","B","C","A","B","B","B","B","PCG_front_radar_front","PCG 4L Radar 4LL","standing"]
["2017-01-20_10-59-22","B","C","A","B","C","A","B","C","B","C","PCG_front_radar_front","PCG 4L Radar 4LL","standing"]
["2017-01-20_11-07-59","A","B","B","B","C","A","C","B","B","B","PCG_front_radar_front","PCG 5L Radar 4L","standing"]
["2017-01-20_11-10-53","A","B","A","B","C","A","B","B","B","B","PCG_front_radar_front","PCG 4L Radar 4LL","standing"]
["2017-01-20_11-16-04","A","B","A","A","C","A","A","B","A","B","PCG_front_radar_front","PCG 2L Radar 4L","standing"]
["2017-01-20_11-18-52","A","B","A","A","A","A","A","B","A","B","PCG_front_radar_front","PCG 2L Radar 4L","standing"]
["2017-01-20_11-22-57","A","C","A","A","C","A","A","C","A","C","PCG_front_radar_front","PCG 2L Radar 4L","standing"]
["2017-01-20_11-25-36","A","B","A","A","C","A","A","B","A","B","PCG_front_radar_front","PCG 2L Radar 4L","standing"]
["2017-01-20_11-28-15","A","B","B","C","C","A","B","B","C","C","PCG_front_radar_front","PCG 4L Radar 4LL","standing"]
["2017-01-20_11-31-04","A","A","C","C","C","A","C","A","C","C","PCG_front_radar_front","PCG 2L Radar 4L","standing"]
["2017-01-20_11-35-29","A","B","C","C","C","A","C","B","C","C","PCG_front_radar_front","PCG 2L Radar 4L","standing"]
["2017-01-20_11-39-39","C","C","A","B","C","A","C","C","B","C","PCG_front_radar_back","PCG 4L Radar back"]
["2017-01-20_11-52-43","B","A","A","A","C","A","A","B","A","B","PCG_neck_radar_neck","PCG carotid L Radar carotid R"]
["2017-01-20_11-55-42","B","B","A","A","C","A","A","B","A","B","PCG_neck_radar_neck","PCG carotid L Radar carotid R"]
["2017-01-20_12-00-18","A","A","A","A","C","B","B","A","A","A","PCG_neck_radar_neck","PCG carotid R Radar carotid L"]

{"sheet":"Person 5","index":4,"n_rows":21,"n_cols":16,"rows_kept":21,"merged":[[0,11,0,12],[0,13,0,17]]}
["Time","Radar S1","Radar S2","PCG S1","PCG S2","Pulse","ECG","Breathing","Quality Radar Signal","Quality PCG Signal","Overall Signal Quality","Measurement Position",null,"Scenario"]
["2017-02-01_09-43-19","A","B","A","A","C","A","A",{"$f":"IF(AND(B2=\"A\",C2=\"A\"),\"A\",IF(OR(B2=\"C\",C2=\"C\"),\"C\",\"B\"))","v":"B"},{"$f":"IF(AND(D2=\"A\",E2=\"A\"),\"A\",IF(OR(D2=\"C\",E2=\"C\"),\"C\",\"B\"))","v":"A"},{"$f":"IF(AND(B2=\"A\",C2=\"A\",D2=\"A\",E2=\"A\"),\"A\",IF(OR(B2=\"C\",C2=\"C\",D2=\"C\",E2=\"C\"),\"C\",\"B\"))","v":"B"},"PCG_front_radar_front","PCG 5L Radar Xiphoid"]
["2017-02-01_09-48-25","A","B","A","B","C","A","A","B","B","B","PCG_front_radar_front","PCG 5L Radar Xiphoid"]
["2017-02-01_10-05-11","A","A","A","A","C","A","A","A","A","A","PCG_front_radar_front","PCG 5L Radar Xiphoid"]
["2017-02-01_10-08-51","C","C","A","A","C","A","A","C","A","C","PCG_front_radar_front","PCG 5L Radar Xiphoid"]
["2017-02-01_10-11-48","C","C","B","B","C","A","A","C","B","C","PCG_front_radar_front","PCG 5L Radar Xiphoid"]
["2017-02-01_10-14-48","A","A","C","C","B","A","A","A","C","C","PCG_front_radar_front","PCG 5L Radar Xiphoid","apnea"]
["2017-02-01_10-19-46","B","C","B","B","C","A","A","C","B","C","PCG_front_radar_front","PCG 5L Radar Xiphoid","angle_variation","30_degree_left","apnea"]
["2017-02-01_10-23-12","B","C","B","C","C","A","A","C","C","C","PCG_front_radar_front","PCG 5L Radar Xiphoid","angle_variation","30_degree_right","apnea"]
["2017-02-01_10-26-22","A","B","A","B","C","A","C","B","B","B","PCG_front_radar_front","PCG 5L Radar Xiphoid","angle_variation","30_degree_right","apnea"]
["2017-02-01_10-31-16","A","C","B","B","C","A","A","C","B","C","PCG_front_radar_front","PCG 5L Radar Xiphoid","artefact_speech"]
["2017-02-01_10-36-00","A","B","B","C","C","A","A","B","C","C","PCG_front_radar_front","PCG 5L Radar Xiphoid","distance_variation","start_at_15cm"]
["2017-02-01_10-41-21","B","B","B","B","C","A","C","B","B","B","PCG_front_radar_front","PCG 5L Radar Xiphoid","distance_variation","start_at_30cm"]
["2017-02-01_10-50-16","A","B","A","B","C","A","A","B","B","B","PCG_front_radar_front","PCG 5L Radar Xiphoid","after_sport"]
["2017-02-01_10-52-32","A","B","A","A","C","A","A","B","A","B","PCG_front_radar_front","PCG 5L Radar Xiphoid","after_sport"]
["2017-02-01_10-57-03","B","C","A","A","A","A","A","C","A","C","PCG_front_radar_back","PCG 5L Radar back"]
["2017-02-01_11-00-37","A","C","A","A","B","A","A","C","A","C","PCG_front_radar_back","PCG 5L Radar back","after_sport"]
["2017-02-01_11-09-40","B","B","C","C","C","A","C","B","C","C","PCG_neck_radar_neck","PCG carotid L Radar carotid R"]
["2017-02-01_11-15-38","B","C","B","A","C","B","C","C","B","C","PCG_neck_radar_neck","PCG carotid L Radar carotid R"]
["2017-02-01_11-48-22","C","C","B","B","C","A","A","C","B","C","PCG_front_radar_neck","PCG 5L Radar carotid R"]
["2017-02-01_11-51-19","A","A","A","A","B","A","A","A","A","A","PCG_front_radar_neck","PCG 5L Radar carotid R"]

{"sheet":"Person 6","index":5,"n_rows":21,"n_cols":15,"rows_kept":21,"merged":[[0,11,0,12],[0,13,0,17]]}
["Time","Radar S1","Radar S2","PCG S1","PCG S2","Pulse","ECG","Breathing","Quality Radar Signal","Quality PCG Signal","Overall Signal Quality","Measurement Position",null,"Scenario"]
["2017-02-06_10-54-37","C","B","A","A","C","B","C",{"$f":"IF(AND(B2=\"A\",C2=\"A\"),\"A\",IF(OR(B2=\"C\",C2=\"C\"),\"C\",\"B\"))","v":"C"},{"$f":"IF(AND(D2=\"A\",E2=\"A\"),\"A\",IF(OR(D2=\"C\",E2=\"C\"),\"C\",\"B\"))","v":"A"},{"$f":"IF(AND(B2=\"A\",C2=\"A\",D2=\"A\",E2=\"A\"),\"A\",IF(OR(B2=\"C\",C2=\"C\",D2=\"C\",E2=\"C\"),\"C\",\"B\"))","v":"C"},"PCG_neck_radar_neck","PCG carotid L Radar carotid R"]
["2017-02-06_10-57-05","A","A","B","A","C","A","C","A","B","B","PCG_neck_radar_neck","PCG carotid L Radar carotid R"]
["2017-02-06_10-28-30","C","C","A","B","C","A","A","C","B","C","PCG_front_radar_front","PCG 2L Radar 5L","distance_variation"]
["2017-02-06_10-35-01","C","C","B","B","C","A","A","C","B","C","PCG_front_radar_front","PCG 2L Radar 5L","distance_variation"]
["2017-02-06_09-01-56","C","C","A","A","C","A","C","C","A","C","PCG_front_radar_front","PCG 2L Radar 5L"]
["2017-02-06_09-05-11","C","C","A","A","C","A","A","C","A","C","PCG_front_radar_front","PCG 2L Radar 5L"]
["2017-02-06_09-57-58","A","B","A","A","C","A","A","B","A","B","PCG_front_radar_front","PCG 2L Radar 5L"]
["2017-02-06_10-17-23","B","C","A","B","C","A","A","C","B","C","PCG_front_radar_front","PCG 2L Radar 5L","after_sport"]
["2017-02-06_10-21-05","C","C","A","B","C","A","A","C","B","C","PCG_front_radar_front","PCG 2L Radar 5L","after_sport"]
["2017-02-06_09-44-15","A","B","A","B","C","A","A","B","B","B","PCG_front_radar_front","PCG 5L Radar 2L","angle_variation","30_degree_left"]
["2017-02-06_09-47-46","A","A","A","A","B","A","A","A","A","A","PCG_front_radar_front","PCG 5L Radar 2L","angle_variation","30_degree_left"]
["2017-02-06_09-41-24","B","B","A","A","C","A","A","B","A","B","PCG_front_radar_front","PCG 5L Radar 2L","angle_variation","30_degree_right"]
["2017-02-06_09-10-20","A","A","A","A","B","B","A","A","A","A","PCG_front_radar_front","PCG 5L Radar 2L"]
["2017-02-06_09-14-32","A","B","A","A","C","A","A","B","A","B","PCG_front_radar_front","PCG 5L Radar 2L"]
["2017-02-06_09-19-08","A","A","A","A","C","A","A","A","A","A","PCG_front_radar_front","PCG 5L Radar 2L"]
["2017-02-06_09-23-58","A","A","A","A","C","A","A","A","A","A","PCG_front_radar_front","PCG 5L Radar 2L"]
["2017-02-06_09-27-58","A","A","A","A","C","A","A","A","A","A","PCG_front_radar_front","PCG 5L Radar 2L","apnea"]
["2017-02-06_09-35-35","A","A","A","A","C","A","A","A","A","A","PCG_front_radar_front","PCG 5L Radar 2L","apnea"]
["2017-02-06_10-01-44","C","C","A","A","C","B","A","C","A","C","PCG_front_radar_front","PCG 5L Radar 5L"]
["2017-02-06_10-48-48","B","B","A","A","C","A","A","B","A","B","PCG_front_radar_back","PCG 2L Radar back","after_sport"]

{"sheet":"Person 7","index":6,"n_rows":40,"n_cols":15,"rows_kept":40,"merged":[[0,11,0,12],[0,13,0,17]]}
["Time","Radar S1","Radar S2","PCG S1","PCG S2","Pulse","ECG","Breathing","Quality Radar Signal","Quality PCG Signal","Overall Signal Quality","Measurement Position",null,"Scenario"]
["2017-02-08_10-12-00","A","A","C","A","B","A","A",{"$f":"IF(AND(B2=\"A\",C2=\"A\"),\"A\",IF(OR(B2=\"C\",C2=\"C\"),\"C\",\"B\"))","v":"A"},{"$f":"IF(AND(D2=\"A\",E2=\"A\"),\"A\",IF(OR(D2=\"C\",E2=\"C\"),\"C\",\"B\"))","v":"C"},{"$f":"IF(AND(B2=\"A\",C2=\"A\",D2=\"A\",E2=\"A\"),\"A\",IF(OR(B2=\"C\",C2=\"C\",D2=\"C\",E2=\"C\"),\"C\",\"B\"))","v":"C"},"PCG_neck_radar_neck","PCG carotid L Radar carotid R"]
["2017-02-08_10-15-28","A","A","B","A","B","A","A",{"$f":"IF(AND(B3=\"A\",C3=\"A\"),\"A\",IF(OR(B3=\"C\",C3=\"C\"),\"C\",\"B\"))","v":"A"},{"$f":"IF(AND(D3=\"A\",E3=\"A\"),\"A\",IF(OR(D3=\"C\",E3=\"C\"),\"C\",\"B\"))","v":"B"},{"$f":"IF(AND(B3=\"A\",C3=\"A\",D3=\"A\",E3=\"A\"),\"A\",IF(OR(B3=\"C\",C3=\"C\",D3=\"C\",E3=\"C\"),\"C\",\"B\"))","v":"B"},"PCG_neck_radar_neck","PCG carotid L Radar carotid R"]
["2017-02-08_10-18-47","A","A","A","A","C","A","A","A","A","A","PCG_neck_radar_neck","PCG carotid R Radar carotid L"]
["2017-02-08_10-21-44","A","A","C","A","A","A","A","A","C","C","PCG_neck_radar_neck","PCG carotid R Radar carotid L"]
["2017-02-08_10-24-21","A","A","C","C","A","A","A","A","C","C","PCG_neck_radar_neck","PCG carotid R Radar carotid L"]
["2017-02-08_09-19-48","A","A","A","A","B","A","A","A","A","A","PCG_front_radar_front","PCG 5L Radar 2L"]
["2017-02-08_09-34-20","A","A","C","C","C","A","C","A","C","C","PCG_front_radar_front","PCG 5L Radar 4L","distance_variation"]
["2017-02-08_09-39-49","A","A","B","B","C","A","A","A","B","B","PCG_front_radar_front","PCG 5L Radar 4L","distance_variation"]
["2017-02-08_10-28-09","B","A","A","B","C","A","C","B","B","B","PCG_front_radar_front","PCG 5L Radar 4L","standing"]
["2017-02-08_10-31-32","A","A","A","A","C","A","C","A","A","A","PCG_front_radar_front","PCG 5L Radar 4L","standing"]
["2017-02-08_09-17-07","B","B","A","B","C","A","A","B","B","B","PCG_front_radar_front","PCG 5L Radar 4L","artefact_speech"]
["2017-02-08_09-10-12","A","A","A","A","B","A","A","A","A","A","PCG_front_radar_front","PCG 5L Radar 4L","apnea"]
["2017-02-08_09-13-27","A","A","A","A","A","A","A","A","A","A","PCG_front_radar_front","PCG 5L Radar 4L","apnea"]
["2017-02-08_09-22-36","B","C","A","A","C","A","A","C","A","C","PCG_front_radar_front","PCG 5L Radar 4L","angle_variation","30_degree_left"]
["2017-02-08_09-29-46","A","A","A","A","A","A","A","A","A","A","PCG_front_radar_front","PCG 5L Radar 4L","angle_variation","30_degree_right"]
["2017-02-08_09-04-15","A","A","A","A","A","A","A","A","A","A","PCG_front_radar_front","PCG 5L Radar 4L"]
["2017-02-08_09-07-15","A","A","A","A","B","A","A","A","A","A","PCG_front_radar_front","PCG 5L Radar 4L"]
["2017-02-08_10-07-34","A","A","A","A","A","A","A","A","A","A","PCG_front_radar_front","PCG 5L Radar 4L"]
["2017-02-08_10-09-12","A","A","A","A","A","A","A","A","A","A","PCG_front_radar_front","PCG 5L Radar 4L"]
["2017-02-08_09-45-26","B","B","A","A","B","A","A","B","A","B","PCG_front_radar_front","PCG 5L Radar 4L","after_sport"]
["2017-02-08_09-48-50","A","A","A","A","A","A","A","A","A","A","PCG_front_radar_front","PCG 5L Radar 4L","after_sport"]
["2017-02-08_08-58-07","A","A","A","A","C","A","C","A","A","A","PCG_front_radar_front","PCG 5L Radar Xiphoid"]
["2017-02-08_09-01-07","B","B","A","A","C","A","C","B","A","B","PCG_front_radar_front","PCG 5L Radar Xiphoid"]
["2017-02-08_09-58-01","B","A","A","A","C","A","A","B","A","B","PCG_front_radar_back","PCG 4L Radar back"]
["2017-02-08_10-01-20","A","A","A","A","C","A","A","A","A","A","PCG_front_radar_back","PCG 4L Radar back","after_sport"]
["2017-02-27_11-14-35","B","A","C","A","B","B","A",{"$f":"IF(AND(B27=\"A\",C27=\"A\"),\"A\",IF(OR(B27=\"C\",C27=\"C\"),\"C\",\"B\"))","v":"B"},{"$f":"IF(AND(D27=\"A\",E27=\"A\"),\"A\",IF(OR(D27=\"C\",E27=\"C\"),\"C\",\"B\"))","v":"C"},{"$f":"IF(AND(B27=\"A\",C27=\"A\",D27=\"A\",E27=\"A\"),\"A\",IF(OR(B27=\"C\",C27=\"C\",D27=\"C\",E27=\"C\"),\"C\",\"B\"))","v":"C"},"PCG_front_radar_front","PCG 2R Radar 2L"]
["2017-02-27_11-51-49","B","A","C","A","A","B","A","B","C","C","PCG_front_radar_front","PCG 2L Radar 2R"]
["2017-02-27_11-56-35","B","A","C","A","A","B","A","B","C","C","PCG_front_radar_front","PCG 2L Radar 2R"]
["2017-02-27_11-59-16","B","A","B","A","A","B","A","B","B","B","PCG_front_radar_front","PCG 2L Radar 2R"]
["2017-02-27_12-02-11","C","C","A","A","C","B","C","C","A","C","PCG_front_radar_front","PCG 5L Radar 4L"]
["2017-02-27_12-09-10","B","A","C","A","A","B","C","B","C","C","PCG_front_radar_front","PCG 2L Radar 2L"]
["2017-02-27_12-12-16","B","A","C","C","B","B","A","B","C","C","PCG_front_radar_front","PCG 2L Radar 2L"]
["2017-02-27_12-15-30","C","A","C","A","A","B","A","C","C","C","PCG_front_radar_front","PCG 2L Radar 4L"]
["2017-02-27_12-19-07","A","A","A","A","A","B","A","A","A","A","PCG_front_radar_front","PCG 5L Radar 4L"]
["2017-02-27_12-21-02","A","A","B","B","A","B","B","A","B","B","PCG_front_radar_front","PCG 5L Radar 4L"]
["2017-02-27_12-23-01","A","A","C","B","A","B","A","A","C","C","PCG_front_radar_front","PCG 5L Radar 4L"]
["2017-02-27_12-30-30","B","B","C","C","C","B","C","B","C","C","PCG_back_radar_back"]
["2017-02-27_12-42-14","B","B","B","C","C","B","A","B","C","C","PCG_front_radar_front","PCG 5L Radar 4L","artefact_movement"]
["2017-02-27_12-48-11","B","A","B","A","C","B","B","B","B","B","PCG_front_radar_front","PCG 5L Radar 4L","artefact_movement"]

{"sheet":"Person 8","index":7,"n_rows":20,"n_cols":16,"rows_kept":20,"merged":[[0,11,0,12],[0,13,0,17]]}
["Time","Radar S1","Radar S2","PCG S1","PCG S2","Pulse","ECG","Breathing","Quality Radar Signal","Quality PCG Signal","Overall Signal Quality","Measurement Position",null,"Scenario"]
["2017-02-10_10-00-49","A","A","A","A","A","A","A",{"$f":"IF(AND(C2=\"A\",D2=\"A\"),\"A\",IF(OR(C2=\"C\",D2=\"C\"),\"C\",\"B\"))","v":"A"},{"$f":"IF(AND(E2=\"A\",F2=\"A\"),\"A\",IF(OR(E2=\"C\",F2=\"C\"),\"C\",\"B\"))","v":"A"},{"$f":"IF(AND(C2=\"A\",D2=\"A\",E2=\"A\",F2=\"A\"),\"A\",IF(OR(C2=\"C\",D2=\"C\",E2=\"C\",F2=\"C\"),\"C\",\"B\"))","v":"A"},"PCG_neck_radar_neck","PCG carotid L Radar carotid R"]
["2017-02-10_10-03-30","A","A","A","A","A","A","A","A","A","A","PCG_neck_radar_neck","PCG carotid L Radar carotid R"]
["2017-02-10_10-06-46","A","A","C","A","A","A","A","C","A","C","PCG_neck_radar_neck","PCG carotid R Radar carotid L"]
["2017-02-10_09-45-28","C","C","A","B","C","A","A","C","C","C","PCG_front_radar_front","PCG 2L Radar 4L","distance_variation"]
["2017-02-10_09-49-27","B","B","A","A","B","A","A","B","B","B","PCG_front_radar_front","PCG 2L Radar 4L","standing"]
["2017-02-10_09-52-36","B","B","A","A","A","A","A","B","A","B","PCG_front_radar_front","PCG 2L Radar 4L","standing"]
["2017-02-10_09-32-09","A","A","A","A","A","A","A","A","A","A","PCG_front_radar_front","PCG 2L Radar 4L",null,null,"50/100 Hz Notch needed"]
["2017-02-10_09-14-02","A","A","B","A","A","A","A","B","A","B","PCG_front_radar_front","PCG 2R Radar 2L"]
["2017-02-10_09-22-17","A","A","A","A","C","A","A","A","C","C","PCG_front_radar_front","PCG 2R Radar 4L","angle_variation","30_degree_left"]
["2017-02-10_09-25-26","B","B","B","A","C","A","A","B","C","C","PCG_front_radar_front","PCG 2R Radar 4L","angle_variation","30_degree_right"]
["2017-02-10_09-28-04","A","A","B","A","C","A","A","B","C","C","PCG_front_radar_front","PCG 2R Radar 4L","angle_variation","30_degree_right"]
["2017-02-10_09-18-32","A","B","B","A","A","A","A","B","A","B","PCG_front_radar_front","PCG 2R Radar 4L"]
["2017-02-10_09-00-14","A","A","A","A","A","A","C","A","A","A","PCG_front_radar_front","PCG 4L Radar Xiphoid","apnea"]
["2017-02-10_09-06-34","A","A","A","A","B","A","A","A","B","B","PCG_front_radar_front","PCG 4L Radar Xiphoid","apnea"]
["2017-02-10_09-09-18","B","B","B","B","B","A","A","B","B","B","PCG_front_radar_front","PCG 4L Radar Xiphoid","apnea"]
["2017-02-10_08-51-11","B","A","A","A","A","A","A","A","A","A","PCG_front_radar_front","PCG 4L Radar Xiphoid"]
["2017-02-10_08-56-20","A","A","B","B","C","A","A","B","C","C","PCG_front_radar_front","PCG 4L Radar Xiphoid"]
["2017-02-10_09-02-41","B","A","A","B","C","A","A","A","C","C","PCG_front_radar_front","PCG 4L Radar Xiphoid"]
["2017-02-10_09-04-54","B","A","A","A","C","A","A","A","C","C","PCG_front_radar_front","PCG 4L Radar Xiphoid"]

{"sheet":"Person 9","index":8,"n_rows":28,"n_cols":15,"rows_kept":28,"merged":[[0,11,0,12],[0,13,0,17]]}
["Time","Radar S1","Radar S2","PCG S1","PCG S2","Pulse","ECG","Breathing","Quality Radar Signal","Quality PCG Signal","Overall Signal Quality","Measurement Position",null,"Scenario"]
["2017-02-13_10-39-05","B","A","B","A","C","A","C",{"$f":"IF(AND(C2=\"A\",D2=\"A\"),\"A\",IF(OR(C2=\"C\",D2=\"C\"),\"C\",\"B\"))","v":"B"},{"$f":"IF(AND(E2=\"A\",F2=\"A\"),\"A\",IF(OR(E2=\"C\",F2=\"C\"),\"C\",\"B\"))","v":"C"},{"$f":"IF(AND(C2=\"A\",D2=\"A\",E2=\"A\",F2=\"A\"),\"A\",IF(OR(C2=\"C\",D2=\"C\",E2=\"C\",F2=\"C\"),\"C\",\"B\"))","v":"C"},"PCG_neck_radar_neck","PCG carotid L Radar carotid R"]
["2017-02-13_10-41-22","A","A","B","A","B","A","C",{"$f":"IF(AND(C3=\"A\",D3=\"A\"),\"A\",IF(OR(C3=\"C\",D3=\"C\"),\"C\",\"B\"))","v":"B"},{"$f":"IF(AND(E3=\"A\",F3=\"A\"),\"A\",IF(OR(E3=\"C\",F3=\"C\"),\"C\",\"B\"))","v":"B"},{"$f":"IF(AND(C3=\"A\",D3=\"A\",E3=\"A\",F3=\"A\"),\"A\",IF(OR(C3=\"C\",D3=\"C\",E3=\"C\",F3=\"C\"),\"C\",\"B\"))","v":"B"},"PCG_neck_radar_neck","PCG carotid L Radar carotid R"]
["2017-02-13_10-43-37","B","A","B","A","A","A","C","B","A","B","PCG_neck_radar_neck","PCG carotid R Radar carotid L"]
["2017-02-13_09-12-49","A","A","A","A","A","A","A","A","A","A","PCG_front_radar_front","PCG 2L Radar 4L"]
["2017-02-13_09-15-35","B","C","A","A","B","A","A","C","B","C","PCG_front_radar_front","PCG 2L Radar 4L"]
["2017-02-13_09-31-52","C","C","A","A","A","A","A","C","A","C","PCG_front_radar_front","PCG 2L Radar 5L"]
["2017-02-13_10-17-08","A","A","A","A","C","A","A","A","C","C","PCG_front_radar_front","PCG 4L Radar 2L","standing"]
["2017-02-13_10-20-00","C","C","A","A","C","A","A","C","C","C","PCG_front_radar_front","PCG 4L Radar 2L","standing"]
["2017-02-13_10-22-39","B","B","B","B","C","A","A","B","C","C","PCG_front_radar_front","PCG 4L Radar 2L","standing"]
["2017-02-13_09-47-05","B","B","A","A","C","B","B","B","C","C","PCG_front_radar_front","PCG 4L Radar 2L","artefact_speech"]
["2017-02-13_09-50-08","A","A","A","A","C","A","B","A","C","C","PCG_front_radar_front","PCG 4L Radar 2L","artefact_speech"]
["2017-02-13_09-58-49","A","A","A","A","C","A","A","A","C","C","PCG_front_radar_front","PCG 4L Radar 2L","apnea","exhaled"]
["2017-02-13_09-55-46","A","A","A","A","C","A","A","A","C","C","PCG_front_radar_front","PCG 4L Radar 2L","apnea","inhaled"]
["2017-02-13_09-35-16","A","A","A","A","B","A","A","A","B","B","PCG_front_radar_front","PCG 4L Radar 2L","angle_variation ","30_degree_left"]
["2017-02-13_09-37-35","A","A","A","A","C","A","A","A","C","C","PCG_front_radar_front","PCG 4L Radar 2L","angle_variation ","30_degree_left"]
["2017-02-13_09-44-00","A","A","A","A","C","A","A","A","C","C","PCG_front_radar_front","PCG 4L Radar 2L","angle_variation ","30_degree_right"]
["2017-02-13_09-17-47","A","A","A","A","B","A","A","A","B","B","PCG_front_radar_front","PCG 4L Radar 2L"]
["2017-02-13_09-20-17","A","A","A","A","A","A","A","A","A","A","PCG_front_radar_front","PCG 4L Radar 2L"]
["2017-02-13_09-23-17","A","A","A","A","A","A","A","A","A","A","PCG_front_radar_front","PCG 4L Radar 2L"]
["2017-02-13_09-25-36","A","B","A","A","B","A","A","B","B","B","PCG_front_radar_front","PCG 4L Radar 2L"]
["2017-02-13_09-53-10","A","A","A","A","C","A","A","A","C","C","PCG_front_radar_front","PCG 4L Radar 2L"]
["2017-02-13_10-00-42","A","A","A","A","B","A","A","A","B","B","PCG_front_radar_front","PCG 4L Radar 2L"]
["2017-02-13_10-26-46","A","A","A","A","C","A","C","A","C","C","PCG_front_radar_front","PCG 4L Radar 2L","after_sport"]
["2017-02-13_10-31-55","C","C","A","A","C","A","C","C","C","C","PCG_front_radar_front","PCG 4L Radar 2L","after_sport"]
["2017-02-13_09-29-31","A","B","A","A","A","A","A","B","A","B","PCG_front_radar_front","PCG 4L Radar Xiphoid"]
["2017-02-13_10-35-49","A","B","A","A","A","A","C","B","A","B","PCG_front_radar_back","PCG 4L Radar back"]
["2017-02-13_10-12-04","C","C","A","A","C","A","A","C","C","C","PCG_front_radar_front","PCG 4L Radar 2L","artefact_movement"]

{"sheet":"Person 10","index":9,"n_rows":23,"n_cols":15,"rows_kept":23,"merged":[[0,11,0,12],[0,13,0,17]]}
["Time","Radar S1","Radar S2","PCG S1","PCG S2","Pulse","ECG","Breathing","Quality Radar Signal","Quality PCG Signal","Overall Signal Quality","Measurement Position",null,"Scenario"]
["2017-02-16_10-14-56","A","A","B","A","A","A","A",{"$f":"IF(AND(B2=\"A\",C2=\"A\"),\"A\",IF(OR(B2=\"C\",C2=\"C\"),\"C\",\"B\"))","v":"A"},{"$f":"IF(AND(D2=\"A\",E2=\"A\"),\"A\",IF(OR(D2=\"C\",E2=\"C\"),\"C\",\"B\"))","v":"B"},{"$f":"IF(AND(B2=\"A\",C2=\"A\",D2=\"A\",E2=\"A\"),\"A\",IF(OR(B2=\"C\",C2=\"C\",D2=\"C\",E2=\"C\"),\"C\",\"B\"))","v":"B"},"PCG_neck_radar_neck","PCG carotid L Radar carotid R"]
["2017-02-16_10-19-44","A","A","B","A","A","A","A","A","B","B","PCG_neck_radar_neck","PCG carotid R Radar carotid L"]
["2017-02-16_09-13-16","A","B","A","A","A","A","A","B","A","B","PCG_front_radar_front","PCG 2L Radar 5L"]
["2017-02-16_09-16-25","C","C","A","A","B","A","A","C","A","C","PCG_front_radar_front","PCG 2L Radar 5L"]
["2017-02-16_09-43-26","B","B","A","A","C","A","A","B","A","B","PCG_front_radar_front","PCG 2LL Radar 2L","distance_variation"]
["2017-02-16_09-46-40","A","A","A","A","C","A","A","A","A","A","PCG_front_radar_front","PCG 2LL Radar 2L","distance_variation"]
["2017-02-16_09-53-17","A","A","A","A","B","A","A","A","A","A","PCG_front_radar_front","PCG 2LL Radar 2L","after_sport"]
["2017-02-16_10-07-43","A","B","A","A","C","A","A","B","A","B","PCG_front_radar_front","PCG 2LL Radar 2L","standing"]
["2017-02-16_10-10-06","B","B","A","A","C","A","A","B","A","B","PCG_front_radar_front","PCG 2LL Radar 2L","standing"]
["2017-02-16_09-31-56","A","A","A","A","C","A","B","A","A","A","PCG_front_radar_front","PCG 2LL Radar 2L","artefact_speech"]
["2017-02-16_09-26-27","A","A","A","A","A","A","A","A","A","A","PCG_front_radar_front","PCG 2LL Radar 2L","apnea","exhaled"]
["2017-02-16_09-24-14","A","A","A","A","A","A","A","A","A","A","PCG_front_radar_front","PCG 2LL Radar 2L","apnea","inhaled"]
["2017-02-16_09-34-37","A","A","A","A","A","A","A","A","A","A","PCG_front_radar_front","PCG 2LL Radar 2L","angle_variation ","30_degree_left"]
["2017-02-16_09-38-46","A","A","A","A","A","A","A","A","A","A","PCG_front_radar_front","PCG 2LL Radar 2L","angle_variation ","30_degree_left"]
["2017-02-16_09-40-56","A","A","A","A","A","A","B","A","A","A","PCG_front_radar_front","PCG 2LL Radar 2L","angle_variation ","30_degree_right"]
["2017-02-16_09-19-26","A","A","A","A","A","A","A","A","A","A","PCG_front_radar_front","PCG 2LL Radar 2L"]
["2017-02-16_09-21-35","A","A","A","A","A","A","A","A","A","A","PCG_front_radar_front","PCG 2LL Radar 2L"]
["2017-02-16_09-29-20","A","A","A","A","A","A","A","A","A","A","PCG_front_radar_front","PCG 2LL Radar 2L"]
["2017-02-16_09-04-48","A","A","A","A","A","A","A","A","A","A","PCG_front_radar_front","PCG 5L Radar 2L"]
["2017-02-16_09-09-19","A","A","A","A","A","A","A","A","A","A","PCG_front_radar_front","PCG 5L Radar 2L"]
["2017-02-16_09-57-58","A","A","A","A","C","A","C","A","A","A","PCG_front_radar_back","PCG 2LL Radar back"]
["2017-02-16_10-04-04","A","A","A","A","C","A","C","A","A","A","PCG_front_radar_back","PCG 2LL Radar back","after_sport"]

{"sheet":"Person 11","index":10,"n_rows":15,"n_cols":15,"rows_kept":15,"merged":[[0,11,0,12],[0,13,0,17]]}
["Time","Radar S1","Radar S2","PCG S1","PCG S2","Pulse","ECG","Breathing","Quality Radar Signal","Quality PCG Signal","Overall Signal Quality","Measurement Position",null,"Scenario"]
["2017-02-16_11-37-59","A","A","A","A","B","A","A",{"$f":"IF(AND(B2=\"A\",C2=\"A\"),\"A\",IF(OR(B2=\"C\",C2=\"C\"),\"C\",\"B\"))","v":"A"},{"$f":"IF(AND(D2=\"A\",E2=\"A\"),\"A\",IF(OR(D2=\"C\",E2=\"C\"),\"C\",\"B\"))","v":"A"},{"$f":"IF(AND(B2=\"A\",C2=\"A\",D2=\"A\",E2=\"A\"),\"A\",IF(OR(B2=\"C\",C2=\"C\",D2=\"C\",E2=\"C\"),\"C\",\"B\"))","v":"A"},"PCG_neck_radar_neck","PCG carotid R Radar carotid L"]
["2017-02-16_11-42-13","A","A","A","A","C","A","A","A","A","A","PCG_neck_radar_neck","PCG carotid R Radar carotid L"]
["2017-02-16_11-30-21","A","B","A","A","C","A","A","B","A","B","PCG_front_radar_front","PCG 2L Radar 4L","distance_variation"]
["2017-02-16_11-50-00","A","A","B","B","B","A","A","A","B","B","PCG_front_radar_front","PCG 2L Radar 4L","after_sport"]
["2017-02-16_11-46-41","A","A","A","A","C","A","A","A","A","A","PCG_front_radar_front","PCG 2L Radar 4L","standing"]
["2017-02-16_11-05-06","A","A","A","A","B","A","A","A","A","A","PCG_front_radar_front","PCG 2L Radar 4L","apnea","exhaled"]
["2017-02-16_10-56-05","A","A","A","A","A","A","A","A","A","A","PCG_front_radar_front","PCG 2L Radar 4L","apnea","inhaled"]
["2017-02-16_11-16-21","A","C","A","A","C","A","A","C","A","C","PCG_front_radar_front","PCG 2L Radar 4L","angle_variation ","30_degree_left"]
["2017-02-16_11-20-16","C","C","B","B","C","A","A","C","B","C","PCG_front_radar_front","PCG 2L Radar 4L","angle_variation ","30_degree_left"]
["2017-02-16_11-26-02","C","C","A","A","C","A","A","C","A","C","PCG_front_radar_front","PCG 2L Radar 4L","angle_variation ","30_degree_right"]
["2017-02-16_10-53-42","A","A","A","A","A","A","A","A","A","A","PCG_front_radar_front","PCG 2L Radar 4L"]
["2017-02-16_11-02-10","A","B","A","A","B","A","A","B","A","B","PCG_front_radar_front","PCG 2L Radar 4L"]
["2017-02-16_10-50-44","A","A","A","A","A","A","A","A","A","A","PCG_front_radar_front","PCG 2L Radar Xiphoid"]
["2017-02-16_11-53-10","B","B","B","B","A","A","A","B","B","B","PCG_front_radar_back","PCG 2L Radar back","after_sport"]